سافانا
type: Concept
modified: 2019-12-15T13:34:49Z
alternative label: سهل عشبي
broader: this
in scheme: this
preferred label: Savannah @en
preferred label: Sabana @es
preferred label: Саванна @ru
preferred label: Savane @fr
related: this
scope note: السهول الخالية من الأشجار في المناطق الاستوائية أو شبه الاستوائية.
scope note: Безлесные равнины в тропических или субтропических регионах. @ru
scope note: Treeless plains in tropical or subtropical regions. @en
scope note: Plaine d'Amérique tropicale dépourvue d'arbres . @fr
scope note: Llanura de América tropical desprovista de árboles. @es

Savannah
type: Item
created: 2026-06-17T07:32:13.866Z
creator: this
has container: concepts
owner: this
primary topic: سافانا