Palaeogeography
type: Item
created: 2026-06-17T07:11:29.769Z
creator: this
has container: concepts
owner: this
primary topic: Palaeogeography

Palaeogeography
type: Concept
modified: 2019-12-22T15:25:39Z
alternative label: Paleogeography
alternative label: جغرافيا العصور القديمة @ar
broader: this
in scheme: this
preferred label: Paléogéographie @fr
preferred label: جغرافيا قديمة @ar
preferred label: Палеогеография @ru
preferred label: Paleogeografía @es
related: this
scope note: Historical reconstitution of the physical geography of past ages.
scope note: Reconstitution historique de la géographie physique des temps passés. @fr
scope note: Reconstitución histórica de la geografía física de tiempos pasados. @es
scope note: إعادة تأريخ الجغرافيا الطبيعية للعصور الماضية. @ar
scope note: Историческая реконструкция физической географии прошлых веков. @ru