بحوث هيدرولوجية
scope note: استخدم للأعمال المتعلقة بمشاريع البحث. للأعمال العلمية العامة، استخدم "الهيدرولوجيا".
scope note: Se refiere a los trabajos relacionados con proyectos de investigación. Para trabajos científicos generales emplear "hidrología". @es
modified: 2019-12-15T13:44:42Z
scope note: S'applique aux travaux liés à des projets de recherche. Pour des travaux scientifiques généraux, utiliser "hydrologie". @fr
preferred label: Recherche hydrologique @fr
alternative label: بحث هيدرولوجي
preferred label: Investigación hidrológica @es
preferred label: Гидрологические исследования @ru
scope note: Используется по отношению к работам в рамках исследовательских проектов. Для работ общего научного характера следует использовать термин "Гидрология". @ru
in scheme: this
scope note: Use for works dealing with research projects. For general scientific works, use "hydrology". @en
type: Concept
narrower: this
broader: this
preferred label: Hydrological research @en

Hydrological research
owner: this
creator: this
created: 2026-06-17T07:18:02.785Z
primary topic: بحوث هيدرولوجية
has container: concepts
type: Item