هيكل زراعي
alternative label: Аграрные системы @ru
scope note: Red compleja de relaciones entre la posesión de tierras, la producción agrícola, los servicios de los que ella depende y las otras instituciones rurales, constituyendo cada parte una unidad integral de todo el conjunto. @es
alternative label: بنية زراعية
preferred label: Structure agraire @fr
broader: this
preferred label: Agrarian structure @en
related: this
scope note: مجموعة من العلاقات المتشعبة القائمة بين حيازة الأراضي والإنتاج والخدمات الداعمة والمؤسسات الريفية المرتبطة بها، يشكل كل منها جزءاً لا يتجزأ من كيان أوسع.
narrower: this
modified: 2019-12-15T14:33:22Z
alternative label: انظمة زراعية
type: Concept
alternative label: Système agraire @fr
scope note: Réseau complexe de relations existant entre le régime foncier, la production agricole et les services dont elle dépend, et les autres institutions rurales rattachées, chacun constituant un tout dans un ensemble plus grand. @fr
alternative label: نظم زراعية
in scheme: this
alternative label: Sistema agrario @es
preferred label: Аграрная структура @ru
preferred label: Estructura agraria @es
scope note: A complex of relationships which exist among land tenure, production and supporting services, and related rural institutions, each constituting an integral part of the wider whole. @en
alternative label: Agrarian systems @en
scope note: Порядок отношений между землевладением, аграрным производством, сервисным агропромышленным комплексом и связанными с ними аграрными институтами, входящими в единую систему. @ru

Agrarian structure
owner: this
creator: this
created: 2026-06-17T07:21:41.076Z
primary topic: هيكل زراعي
has container: concepts
type: Item