Environmental indicators
owner: this
creator: this
created: 2026-06-17T07:20:15.982Z
primary topic: Environmental indicators
has container: concepts
type: Item

Environmental indicators
related: this
preferred label: Показатели состояния окружающей среды @ru
scope note: Datos numéricos empleados en la formulación y la supervisión de las políticas de medio ambiente. @es
type: Concept
preferred label: Indicateur de l'environnement @fr
scope note: Цифровые показатели, используемые в качестве ориентиров при разработке и мониторинге политики в области окружающей среды. @ru
preferred label: Indicadores ambientales @es
preferred label: مؤشرات بيئية @ar
scope note: بيانات رقمية تُستخدم كمعايير في صياغة ومراقبة السياسة البيئية. @ar
scope note: Numerical data used as benchmarks in the formulation and monitoring of environmental policy.
in scheme: this
broader: this
scope note: Données numériques utilisées dans la formulation et le suivi des politiques de l'environnement. @fr
created: 2003-07-23T00:00:00
modified: 2019-12-15T13:45:16Z