Geoengineering
type: Concept
scope note: تشير إلى مجموعة واسعة من الأساليب والتكنولوجيات التي تهدف إلى تغيير النظام المناخي تغييرًا متعمدًا من أجل التخفيف من آثار تغير المناخ. @ar
scope note: Refers to a broad set of methods and technologies that aim to deliberately alter the climate system in order to alleviate the impacts of climate change.
scope note: Se rapporte à un vaste ensemble de méthodes et de techniques visant à modifier délibérément le système climatique pour lutter contre les effets du changement climatique. @fr
scope note: Vasto conjunto de métodos y tecnologías que tienen por objeto alterar deliberadamente el sistema climático a fin de aliviar los impactos del cambio climático. @es
in scheme: this
preferred label: Геоинженерия @ru
preferred label: الهندسة الجيولوجية @ar
preferred label: Geoingeniería @es
preferred label: Géo-ingénierie @fr
related: this
created: 2022-03-14T16:23:35Z
alternative label: Climate engineering
alternative label: Ingénierie climatique @fr
alternative label: Ingeniería climática @es
alternative label: هندسة المناخ @ar
broader: this
modified: 2022-06-27T11:38:48Z

Geoengineering
type: Item
owner: this
creator: this
created: 2026-06-17T07:21:22.183Z
primary topic: Geoengineering
has container: concepts