Educational articulation
owner: this
creator: this
created: 2026-06-17T07:21:15.234Z
primary topic: Educational articulation
has container: concepts
type: Item

Educational articulation
type: Concept
broader: this
related: this
narrower: this
preferred label: تمفصٌل تعليمي @ar
in scheme: this
preferred label: Организационные взаимосвязи в сфере образования @ru
scope note: Dispositivo de estructuras educativas que permite el paso entre niveles de educación o entre diferentes tipos de escuelas. @es
preferred label: Articulation éducative @fr
modified: 2019-12-15T13:28:03Z
scope note: Dispositif des structures éducatives permettant le passage entre les niveaux d'éducation ou entre les types d'écoles. @fr
preferred label: Articulación educativa @es
scope note: بين المؤسسات التعليمية من مستويات مختلفة أو أنواع مختلفة من المدارس. @ar
scope note: Между учебными заведениями различного уровня или разными типами школ. @ru
scope note: Between levels of education or types of school.