Film strips
owner: this
creator: this
created: 2026-06-17T07:23:37.094Z
primary topic: اشرطة الافلام
has container: concepts
type: Item

اشرطة الافلام
preferred label: Film fixe @fr
scope note: Bande de film comportant des images photographiques ou autre matériel graphique projetés comme images fixes. Largement utilisé comme support à l'enseignement audiovisuel. @fr
scope note: شريط من الصور المتحركة يحمل صورة ثابتة، أو غيرها من المواد المصورة، على كل إطار من إطاراته. يستخدم على نطاق واسع كأداة للتعليم السمعي البصري.
preferred label: Диафильмы @ru
type: Concept
preferred label: Cinta de película @es
modified: 2019-12-15T14:33:23Z
in scheme: this
scope note: A strip of motion picture carrying a still photograph, or other graphic material, on each of its frames. Widely used as an audiovisual instruction tool. @en
scope note: Banda de película donde están las imágenes fotográficas u otro material gráfico proyectadas como imágenes fijas, muy empleado como herramienta de enseñanza de las artes audiovisuales. @es
related: this
alternative label: شرائط الافلام
preferred label: Film strips @en
broader: this
scope note: Фотолента, на каждом кадре которой изображена фотография или иной графический материал @ru
alternative label: افلام ثابتة
scope note: широко используется в качестве аудиовизуального учебного пособия. @ru