Participatory development
type: Item
created: 2026-06-17T07:13:26.93Z
creator: this
has container: concepts
owner: this
primary topic: Participatory development

Participatory development
type: Concept
modified: 2024-10-03T14:47:08Z
alternative label: Desarrollo local @es
alternative label: Développement au niveau local @fr
alternative label: تنمية القواعد الشعبية @ar
alternative label: Grassroots development
alternative label: تنمية محلية @ar
alternative label: Développement à la base @fr
alternative label: تنمية على مستوى القاعدة الشعبية @ar
alternative label: Местное развитие @ru
alternative label: Развитие сознания масс @ru
alternative label: Local development
broader: this
in scheme: this
narrower: this
preferred label: Консенсусное развитие @ru
preferred label: Desarrollo participativo @es
preferred label: Développement participatif @fr
preferred label: تنمية تشاركية @ar
related: this
scope note: Институционализация участия населения в процессе развития. @ru
scope note: Institutionnalisation de la participation populaire dans le processus de développement. @fr
scope note: Institutionalization of popular participation in the development process.
scope note: مؤسسية المشاركة الشعبية في عملية التنمية. @ar
scope note: Institucionalización de la participación popular en el proceso de desarrollo. @es