غطاء نباتي
narrower: this
scope note: Vie végétale caractéristique d'une zone écologique. S'il s'agit de taxonomie, utiliser "flore". @fr
in scheme: this
modified: 2019-12-15T13:51:56Z
related: this
type: Concept
broader: this
alternative label: كساء خضري
alternative label: كساء نباتي
preferred label: Vegetation @en
preferred label: Растительность @ru
alternative label: غطاء خضري
scope note: Vida vegetal característica de una zona ecológica. Si se trata de aspectos taxonómicos, utilizar "flora". @es
scope note: Растительная жизнь, характерная для конкретного экологического района. По таксономическим аспектам используйте термин "Флора". @ru
preferred label: Végétation @fr
preferred label: Vegetación @es
scope note: Plant life characteristic of an ecological area. For taxonomic aspects use "flora". @en
scope note: الحياة النباتية المميزة لمنطقة بيئية. بالنسبة للجوانب التصنيفية استخدم "النبيت".

Vegetation
owner: this
creator: this
created: 2026-06-17T07:27:46.563Z
primary topic: غطاء نباتي
has container: concepts
type: Item