Climate
type: Item
owner: this
creator: this
created: 2026-06-17T07:23:14.378Z
primary topic: Climate
has container: concepts

Climate
type: Concept
scope note: Среднестатистические погодные условия в любом регионе. @ru
scope note: متوسط الطقس لأي منطقة. @ar
scope note: Déterminé par l'ensemble des conditions météorologiques prévalant dans une région. @fr
scope note: Condiciones meteorológicas predominantes en una región. @es
scope note: Average weather of any region.
related: this
broader: this
in scheme: this
preferred label: Clima @es
preferred label: Climat @fr
preferred label: Климат @ru
preferred label: مناخ @ar
modified: 2019-12-15T13:35:48Z
narrower: this
alternative label: طقس @ar