Norma de trabajo
type: Concept
alternative label: Norma laboral
alternative label: مواصفات العمل @ar
preferred label: Norme de travail @fr
preferred label: معايير العمل @ar
preferred label: Labour standards @en
preferred label: Трудовые нормативы @ru
related: this
modified: 2019-12-15T14:33:26Z
in scheme: this
broader: this
scope note: Стандарты в отношении трудового найма и условий труда, зафиксированные в коллективных договорах между работодателями и работниками, в трудовых законах или нормативных актах, принятых законодательной властью. @ru
scope note: Norma relativa al empleo y a las condiciones de trabajo, establecida en los convenios colectivos entre patronos y trabajadores o en leyes o reglamentos laborales adoptados por la legislatura.
scope note: Norme concernant l'emploi et les conditions de travail, établie dans des conventions collectives entre employeurs et travailleurs ou en vertu de lois ou règlements du travail adoptés par la législature. @fr
scope note: Standards concerning employment and working conditions set out in collective agreements between employers and workers or in labour laws and regulations adopted by the legislature. @en
scope note: المعايير المتعلقة بشروط التوظيف والعمل المنصوص عليها في الاتفاقات الجماعية بين أصحاب العمل والعاملين أو في قوانين العمل واللوائح المعتمدة من السلطة التشريعية. @ar

Labour standards
type: Item
owner: this
creator: this
created: 2026-06-17T07:23:54.869Z
primary topic: Norma de trabajo
has container: concepts