Rights of special groups
owner: this
creator: this
created: 2026-06-17T07:25:36.095Z
primary topic: حقوق فئات خاصة
has container: concepts
type: Item

حقوق فئات خاصة
alternative label: حقوق مجموعات خاصة
scope note: لا تستخدم بمثابة واصف.
narrower: this
top concept of: this
scope note: Ne pas utiliser comme descripteur. @fr
modified: 2019-12-15T14:25:14Z
preferred label: Rights of special groups @en
type: Concept
scope note: No utilizar como descriptor. @es
alternative label: حقوق جماعات خاصة
alternative label: حقوق فئات بعينها
preferred label: Права отдельных групп @ru
scope note: Не использовать в качестве дескриптора. @ru
scope note: Do not use as a descriptor. @en
preferred label: Droits de groupes spéciaux @fr
preferred label: Derechos de grupos especiales @es
in scheme: this