Integrated development
related: this
preferred label: Développement intégré @fr
scope note: تنمية تأخذ في الاعتبار مجموعة من العوامل المميزة لأحوال البشر. @ar
preferred label: تنمية متكاملة @ar
scope note: Desarrollo que tiene en cuenta una serie de factores característicos de la condición humana. @es
modified: 2019-12-22T15:25:35Z
preferred label: Интегрированное развитие @ru
preferred label: Desarrollo integrado @es
broader: this
in scheme: this
scope note: Development taking into account a range of factors characteristic of the human condition.
scope note: Développement prenant en compte un ensemble de facteurs caractéristiques de la condition humaine. @fr
scope note: Развитие, учитывающее набор факторов, характеризующих состояние человека. @ru
type: Concept

Integrated development
owner: this
creator: this
created: 2026-06-17T07:16:18.306Z
primary topic: Integrated development
has container: concepts
type: Item