Interdependence
owner: this
creator: this
created: 2026-06-17T07:18:53.104Z
primary topic: اعتماد متبادل
has container: concepts
type: Item

اعتماد متبادل
alternative label: Interdependencia económica @es
top concept of: this
alternative label: ترابط
alternative label: Economic interdependence @en
type: Concept
related: this
scope note: الاعتماد الاقتصادي المتبادل بين الدول. وللجهود الحثيثة الرامية إلى تعزيز الروابط الاقتصادية، استخدم "التعاون الاقتصادي"، "التكامل الاقتصادي"، وما إلى ذلك.
alternative label: اعتماد اقتصادي متبادل
alternative label: Экономическая взаимозависимость @ru
scope note: по отношению к активным действиям в целях более тесных экономических взаимосвязей используйте термины "Экономическое сотрудничество", "Экономическая интеграция" и т.д. @ru
scope note: Mutual economic dependence among countries. For active efforts to promote closer economic ties, use "economic cooperation", "economic integration", etc. @en
preferred label: Interdependence @en
alternative label: Interdépendance économique @fr
preferred label: Interdependencia @es
in scheme: this
modified: 2019-12-21T23:41:24Z
preferred label: Взаимозависимость @ru
scope note: Dépendance économique mutuelle entre pays. Pour signifier les efforts déployés pour promouvoir un resserrement des liens économiques, utiliser "coopération économique", "intégration économique", etc. @fr
scope note: Взаимная экономическая зависимость между странами @ru
alternative label: تكافل
scope note: Mutua dependencia económica entre países. Para referirse a los esfuerzos desplegados para estrechar las relaciones económicas, utilizar "cooperación económica", "integración económica", etc. @es
preferred label: Interdépendance @fr
alternative label: ترابط اقتصادي
narrower: this
alternative label: تكافل اقتصادي