Educational reform
owner: this
creator: this
created: 2026-06-17T07:16:07.149Z
primary topic: Educational reform
has container: concepts
type: Item

Educational reform
alternative label: تغيير تربوي @ar
alternative label: Изменения в области образования @ru
type: Concept
alternative label: Reforma educativa @es
scope note: Change planned or in process of implementation to a major part of a national system of education.
modified: 2019-12-15T13:28:10Z
related: this
alternative label: Reforma educacional @es
preferred label: Réforme de l'éducation @fr
in scheme: this
scope note: Запланированные или реализуемые изменения в отношении основной части национальной системы образования. @ru
alternative label: Процесс обновления в области образования @ru
preferred label: اصلاح تربوي @ar
scope note: Changement planifié ou en cours d'application d'une partie importante d'un système national d'éducation. @fr
alternative label: Renouveau de l'éducation @fr
scope note: تغيير مخطط أو قيد التنفيذ في جزء كبير من نظام التعليم الوطني. @ar
alternative label: Educational change
alternative label: Changement en éducation @fr
preferred label: Реформа образования @ru
preferred label: Reforma de la educación @es
alternative label: تجديد تربوي @ar
broader: this
alternative label: Educational renewal
alternative label: اصلاح التعليم @ar
scope note: Cambio planificado, o en proceso de aplicación, de una parte determinante de un sistema nacional de educación. @es
alternative label: Renouveau éducatif @fr