Educational interaction process
owner: this
creator: this
created: 2026-06-17T07:27:08.963Z
primary topic: Educational interaction process
has container: concepts
type: Item

Educational interaction process
alternative label: Análisis del proceso de interacción @es
alternative label: Анализ процесса взаимодействия @ru
modified: 2019-12-15T12:03:51Z
in scheme: this
preferred label: Процесс образовательного взаимодействия @ru
scope note: Observation of student behaviour in response to various teaching attitudes.
type: Concept
related: this
scope note: ملاحظة سلوك الطلاب فيما يتعلق بالاتجاهات التعليمية المختلفة. @ar
alternative label: تحليل عملية التفاعل @ar
scope note: Observación del comportamiento de un estudiante en respuesta a diversas estrategias educativas. @es
alternative label: Analyse du processus d'interaction @fr
broader: this
preferred label: عملية التفاعل التربوي @ar
preferred label: Proceso de interacción educativa @es
scope note: Наблюдение за изменениями в поведении учащихся в связи с применением различных учебных подходов. @ru
scope note: Observation du comportement des étudiants en réponse à différentes stratégies d'enseignement. @fr
alternative label: Interaction process analysis
preferred label: Processus d'interaction éducative @fr