عمالة كاملة
scope note: حالة يتم فيها تزويد جميع الأشخاص الراغبين في العثور على وظيفة بوظائف مدفوعة الأجر.
scope note: Situation where all persons seeking employment have been provided with paid positions. @en
in scheme: this
scope note: Situation selon laquelle toute la main-d'oeuvre disponible a pu bénéficier d'un emploi rémunéré. @fr
scope note: Situación en la cual toda la mano de obra disponible se ha podido beneficiar de un empleo remunerado. @es
preferred label: Plein emploi @fr
scope note: Ситуация, в которой все лица, заинтересованные найти работу, обеспечены оплачиваемыми рабочими местами. @ru
preferred label: Полная занятость @ru
modified: 2019-12-21T23:41:15Z
preferred label: Pleno empleo @es
broader: this
type: Concept
alternative label: تشغيل كامل
preferred label: Full employment @en

Full employment
owner: this
creator: this
created: 2026-06-17T07:31:53.112Z
primary topic: عمالة كاملة
has container: concepts
type: Item