Dropping out
type: Item
created: 2026-06-17T07:33:34.462Z
creator: this
has container: concepts
owner: this
primary topic: Abandon en cours d'études

Abandon en cours d'études
type: Concept
modified: 2019-12-15T13:59:42Z
alternative label: Abandon précoce
alternative label: ترك المدرسة @ar
alternative label: Abandono escolar @es
alternative label: Décrochage scolaire
alternative label: Abandon scolaire
broader: this
in scheme: this
preferred label: تسرب @ar
preferred label: Deserción escolar @es
preferred label: Dropping out @en
preferred label: Отсев учащихся @ru
related: this
scope note: Преждевременное завершение пребывания в школе до окончания начатого цикла или курса обучения. @ru
scope note: Premature school leaving before completing a cycle or course already begun. @en
scope note: مغادرة المدرسة قبل الأوان، قبل إكمال دورة أو مقرر بدأ بالفعل. @ar
scope note: Départ prématuré de l'école avant d'avoir complété un cycle ou un cours commencés.
scope note: Partida prematura del colegio antes de haber concluído un ciclo completo o un curso ya iniciado. @es