Resource centres
owner: this
creator: this
created: 2026-06-17T07:14:55.808Z
primary topic: Centro de material didáctico
has container: concepts
type: Item

Centro de material didáctico
preferred label: مراكز الموارد @ar
related: this
preferred label: Centre de matériel didactique @fr
scope note: Центры, предлагающие большой выбор ресурсов (инвентаря, материалов, информации, оборудования) для использования как в помещении, так и на открытом воздухе. В необходимых случаях используйте более точный термин. @ru
top concept of: this
alternative label: Centro de recursos didácticos
preferred label: Resource centres @en
scope note: Indoor or outdoor areas that offer a variety of resources (e.g. supplies, materials, information, equipment). Use a more precise term, if possible. @en
narrower: this
scope note: المناطق الداخلية أو الخارجية التي توفر مجموعة متنوعة من الموارد (على سبيل المثال اللوازم والمواد والمعلومات والمعدات). عند الضرورة، استخدم مصطلحًا أكثر تحديدًا. @ar
alternative label: مراكز الموارد التعليمية @ar
in scheme: this
scope note: Áreas interiores o exteriores que ofrecen variedad de recursos (material escolar, información, equipos). Utilizar un termino más preciso si es posible.
alternative label: مراكز مصادر التعلم @ar
alternative label: Centro de recursos pedagógicos
modified: 2019-12-17T16:38:12Z
alternative label: Центры образовательных ресурсов @ru
type: Concept
alternative label: Centre de ressources pédagogiques @fr
alternative label: Centro de material pedagógico
alternative label: Educational resource centres @en
alternative label: Centre de ressources didactiques @fr
scope note: Espace intérieur ou extérieur offrant une variété de ressources (p. ex., des fournitures, du matériel, de l'information et des équipements). @fr
preferred label: Ресурсные центры @ru