Aptitude
owner: this
creator: this
created: 2026-06-17T07:21:11.54Z
primary topic: Aptitude
has container: concepts
type: Item

Aptitude
scope note: Capacité potentielle d'un individu à remplir une tâche dont il n'a pas encore l'expérience. @fr
preferred label: Склонность @ru
related: this
broader: this
type: Concept
scope note: The potential ability of an individual to perform an as yet unlearned task or skill.
preferred label: استعداد @ar
in scheme: this
scope note: قدرة الفرد المحتملة على أداء مهمة أو مهارة لم يكتسبها من قبل. @ar
scope note: Потенциальная способность человека выполнять до сих пор не изученную задачу или работу. @ru
modified: 2019-12-15T14:00:11Z
scope note: Capacidad potencial de un individuo de desempeñar una tarea en la que carece de experiencia. @es
narrower: this
alternative label: قدرات @ar
preferred label: Aptitud @es